Reaction Details
TargetCathepsin S
LigandBDBM50331558
Substrate/Competitorn/a
Meas. Tech.ChEMBL_687416 (CHEMBL1292092)
IC50 1.1±n/a nM
Citation Cai, JRobinson, JBelshaw, SEverett, KFradera, Xvan Zeeland, Mvan Berkom, Lvan Rijnsbergen, PPopplestone, LBaugh, MDempster, MBruin, JHamilton, WKinghorn, EWestwood, PKerr, JRankovic, ZArbuckle, WBennett, DJJones, PSLong, CMartin, IUitdehaag, JCMeulemans, T Trifluoromethylphenyl as P2 for ketoamide-based cathepsin S inhibitors. Bioorg Med Chem Lett20:6890-4 (2010) 
 
Cathepsin S
Name:Cathepsin S
Type:Protein
Mol. Mass.:37507.38
Organism:Homo sapiens (Human)
Description:P25774
Residue:331
BDBM50331558
NameBDBM50331558
Synonyms:CHEMBL1289536 | N-(1-amino-1,2-dioxopentan-3-yl)-2-chloro-4-(pyridin-2-ylmethoxy)-3-(trifluoromethyl)benzamide
TypeSmall organic molecule
Emp. Form.C19H17ClF3N3O4
Mol. Mass.443.804
SMILESCCC(NC(=O)c1ccc(OCc2ccccn2)c(c1Cl)C(F)(F)F)C(=O)C(N)=O