Reaction Details
TargetPotassium voltage-gated channel subfamily H member 2
LigandBDBM50331809
Substrate/Competitorn/a
Meas. Tech.ChEMBL_686871 (CHEMBL1291240)
IC50 1400±n/a nM
Citation Siu, TKozina, ESJung, JRosenstein, CMathur, AAltman, MDChan, GXu, LBachman, EMo, JRBouthillette, MRush, TDinsmore, CJMarshall, CGYoung, JR The discovery of tricyclic pyridone JAK2 inhibitors. Part 1: hit to lead. Bioorg Med Chem Lett20:7421-5 (2010) 
 
Potassium voltage-gated channel subfamily H member 2
Name:Potassium voltage-gated channel subfamily H member 2
Type:Multi-pass membrane protein
Mol. Mass.:126672.65
Organism:Homo sapiens (Human)
Description:Q12809
Residue:1159
BDBM50331809
NameBDBM50331809
Synonyms:(R)-6-(1,1,1-trifluoro-3-methylbutan-2-ylamino)pyrido[4,3-c][1,6]naphthyridin-1(2H)-one | CHEMBL1289218
TypeSmall organic molecule
Emp. Form.C16H15F3N4O
Mol. Mass.336.3117
SMILESCC(C)[C@@H](Nc1nc2cc[nH]c(=O)c2c2cnccc12)C(F)(F)F