Reaction Details
TargetTyrosine-protein kinase JAK2
LigandBDBM50331809
Substrate/Competitorn/a
Meas. Tech.ChEMBL_686866 (CHEMBL1291235)
IC50 1±n/a nM
Citation Siu, TKozina, ESJung, JRosenstein, CMathur, AAltman, MDChan, GXu, LBachman, EMo, JRBouthillette, MRush, TDinsmore, CJMarshall, CGYoung, JR The discovery of tricyclic pyridone JAK2 inhibitors. Part 1: hit to lead. Bioorg Med Chem Lett20:7421-5 (2010) 
 
Tyrosine-protein kinase JAK2
Name:Tyrosine-protein kinase JAK2
Type:Protein
Mol. Mass.:130684.68
Organism:Homo sapiens (Human)
Description:O60674
Residue:1132
BDBM50331809
NameBDBM50331809
Synonyms:(R)-6-(1,1,1-trifluoro-3-methylbutan-2-ylamino)pyrido[4,3-c][1,6]naphthyridin-1(2H)-one | CHEMBL1289218
TypeSmall organic molecule
Emp. Form.C16H15F3N4O
Mol. Mass.336.3117
SMILESCC(C)[C@@H](Nc1nc2cc[nH]c(=O)c2c2cnccc12)C(F)(F)F