Reaction Details
TargetDisintegrin and metalloproteinase domain-containing protein 17
LigandBDBM50332285
Substrate/Competitorn/a
Meas. Tech.ChEMBL_686062 (CHEMBL1292818)
Ki 0.290000±n/a nM
Citation Girijavallabhan, VMChen, LDai, CFeltz, RJFirmansjah, LLi, DKim, SHKozlowski, JALavey, BJKosinski, APiwinski, JJPopovici-Muller, JRizvi, RRosner, KEShankar, BBShih, NYSiddiqui, MATong, LWong, MKYang, DYYang, LYu, WZhou, GGuo, ZOrth, PMadison, VBian, HLundell, DNiu, XShah, HSun, JUmland, S Novel TNF-a converting enzyme (TACE) inhibitors as potential treatment for inflammatory diseases. Bioorg Med Chem Lett20:7283-7 (2010) 
 
Disintegrin and metalloproteinase domain-containing protein 17
Name:Disintegrin and metalloproteinase domain-containing protein 17
Type:Enzyme
Mol. Mass.:93007.89
Organism:Homo sapiens (Human)
Description:
Residue:824
BDBM50332285
NameBDBM50332285
Synonyms:(R)-5-((4-((4-ethylpiperazin-1-yl)methyl)phenyl)ethynyl)-5-((6-methoxy-1-oxoisoindolin-2-yl)methyl)imidazolidine-2,4-dione US8541572, 515
TypeSmall organic molecule
Emp. Form.C28H31N5O4
Mol. Mass.501.5768
SMILESCCN1CCN(Cc2ccc(cc2)C#C[C@]2(CN3Cc4ccc(OC)cc4C3=O)NC(=O)NC2=O)CC1