Reaction Details
Target72 kDa type IV collagenase
LigandBDBM50332283
Substrate/Competitorn/a
Meas. Tech.ChEMBL_686065 (CHEMBL1292821)
IC50 431±n/a nM
Citation Girijavallabhan, VMChen, LDai, CFeltz, RJFirmansjah, LLi, DKim, SHKozlowski, JALavey, BJKosinski, APiwinski, JJPopovici-Muller, JRizvi, RRosner, KEShankar, BBShih, NYSiddiqui, MATong, LWong, MKYang, DYYang, LYu, WZhou, GGuo, ZOrth, PMadison, VBian, HLundell, DNiu, XShah, HSun, JUmland, S Novel TNF-a converting enzyme (TACE) inhibitors as potential treatment for inflammatory diseases. Bioorg Med Chem Lett20:7283-7 (2010) 
 
72 kDa type IV collagenase
Name:72 kDa type IV collagenase
Type:Enzyme
Mol. Mass.:73870.36
Organism:Homo sapiens (Human)
Description: P08253
Residue:660
BDBM50332283
NameBDBM50332283
Synonyms:(R)-5-((6-methoxy-1-oxoisoindolin-2-yl)methyl)-5-(pyridin-3-ylethynyl)imidazolidine-2,4-dione | CHEMBL1287851
TypeSmall organic molecule
Emp. Form.C20H16N4O4
Mol. Mass.376.3654
SMILESCOc1ccc2CN(C[C@]3(NC(=O)NC3=O)C#Cc3cccnc3)C(=O)c2c1