Reaction Details
TargetTyrosine-protein kinase JAK3
LigandBDBM50332623
Substrate/Competitorn/a
Meas. Tech.ChEMBL_695928 (CHEMBL1641115)
IC50 13±n/a nM
Citation Flanagan, MEBlumenkopf, TABrissette, WHBrown, MFCasavant, JMShang-Poa, CDoty, JLElliott, EAFisher, MBHines, MKent, CKudlacz, EMLillie, BMMagnuson, KSMcCurdy, SPMunchhof, MJPerry, BDSawyer, PSStrelevitz, TJSubramanyam, CSun, JWhipple, DAChangelian, PS Discovery of CP-690,550: a potent and selective Janus kinase (JAK) inhibitor for the treatment of autoimmune diseases and organ transplant rejection. J Med Chem53:8468-84 (2010) 
 
Tyrosine-protein kinase JAK3
Name:Tyrosine-protein kinase JAK3
Type:Protein
Mol. Mass.:125111.08
Organism:Homo sapiens (Human)
Description:P52333
Residue:1124
BDBM50332623
NameBDBM50332623
Synonyms:CHEMBL1630786 | N-Benzyl-2-((R)-2-((1S,3S,4R)-4-methyl-3-(methyl(7H-pyrrolo-[2,3-d]pyrimidin-4-yl)amino)cyclohexyl)propoxy)acetamide
TypeSmall organic molecule
Emp. Form.C26H35N5O2
Mol. Mass.449.5884
SMILESC[C@@H](COCC(=O)NCc1ccccc1)[C@H]1CC[C@@H](C)[C@H](C1)N(C)c1ncnc2[nH]ccc12