Reaction Details
TargetMetabotropic glutamate receptor 2
LigandBDBM50332632
Substrate/Competitorn/a
Meas. Tech.ChEMBL_697887 (CHEMBL1632947)
Ki 1000±n/a nM
Citation Schann, SMayer, SFranchet, CFrauli, MSteinberg, EThomas, MBaron, LNeuville, P Chemical switch of a metabotropic glutamate receptor 2 silent allosteric modulator into dual metabotropic glutamate receptor 2/3 negative/positive allosteric modulators. J Med Chem53:8775-9 (2010) 
 
Metabotropic glutamate receptor 2
Name:Metabotropic glutamate receptor 2
Type:Enzyme
Mol. Mass.:95584.88
Organism:Homo sapiens (Human)
Description:Q14416
Residue:872
BDBM50332632
NameBDBM50332632
Synonyms:CHEMBL1630805 | N-(4-Chlorophenyl)-7-oxo-7,7a-dihydrocyclopropa[b]chromene-1a(1H)-carboxamide
TypeSmall organic molecule
Emp. Form.C17H13ClN2O3
Mol. Mass.328.75
SMILESClc1ccc(NC(=O)C23CC2C(N=O)c2ccccc2O3)cc1