Reaction Details
TargetTransient receptor potential cation channel subfamily V member 1
LigandBDBM50332850
Substrate/Competitorn/a
Meas. Tech.ChEMBL_696915 (CHEMBL1639431)
IC50 15±n/a nM
Citation Lebsack, ADRech, JCBranstetter, BJHawryluk, NAMerit, JEAllison, BRynberg, RBuma, JRizzolio, MSwanson, NAo, HMaher, MPHerrmann, MFreedman, JScott, BPLuo, LBhattacharya, AWang, QChaplan, SRWickenden, ADBreitenbucher, JG 1,2-diamino-ethane-substituted-6,7,8,9-tetrahydro-5H-pyrimido[4,5-d]azepines as TRPV1 antagonists with improved properties. Bioorg Med Chem Lett20:7142-6 (2010) 
 
Transient receptor potential cation channel subfamily V member 1
Name:Transient receptor potential cation channel subfamily V member 1
Type:Protein
Mol. Mass.:94960.75
Organism:Homo sapiens (Human)
Description:Q8NER1
Residue:839
BDBM50332850
NameBDBM50332850
Synonyms:2-(4-cyclopentylpiperazin-1-yl)-N-(4-(trifluoromethyl)phenyl)-7-(3-(trifluoromethyl)pyridin-2-yl)-6,7,8,9-tetrahydro-5H-pyrimido[5,4-d]azepin-4-amine | CHEMBL1630303
TypeSmall organic molecule
Emp. Form.C30H33F6N7
Mol. Mass.605.6203
SMILESFC(F)(F)c1ccc(Nc2nc(nc3CCN(CCc23)c2ncccc2C(F)(F)F)N2CCN(CC2)C2CCCC2)cc1