Reaction Details
TargetCannabinoid receptor 1
LigandBDBM50332882
Substrate/Competitorn/a
Meas. Tech.ChEMBL_694005 (CHEMBL1636581)
Ki 311.4±n/a nM
Citation Silvestri, RLigresti, ALa Regina, GPiscitelli, FGatti, VLavecchia, ABrizzi, APasquini, SAllarà, MFantini, NCarai, MABigogno, CRozio, MGSinisi, RNovellino, EColombo, GDi Marzo, VDondio, GCorelli, F Synthesis and biological evaluation of new N-alkyl 1-aryl-5-(1H-pyrrol-1-yl)-1H-pyrazole-3-carboxamides as cannabinoid receptor ligands. Eur J Med Chem45:5878-86 (2010) 
 
Cannabinoid receptor 1
Name:Cannabinoid receptor 1
Type:G Protein-Coupled Receptor (GPCR)
Mol. Mass.:52868.96
Organism:Homo sapiens (Human)
Description:P21554
Residue:472
BDBM50332882
NameBDBM50332882
Synonyms:1-(2,4-Difluorophenyl)-5-(2,5-dimethyl-1H-pyrrol-1-yl)-Nhexyl-4-methyl-1H-pyrazole-3-carboxamide | CHEMBL1631290
TypeSmall organic molecule
Emp. Form.C23H28F2N4O
Mol. Mass.414.4914
SMILESCCCCCCNC(=O)c1nn(c(c1C)-n1c(C)ccc1C)-c1ccc(F)cc1F