Reaction Details
TargetCannabinoid receptor 1
LigandBDBM50332888
Substrate/Competitorn/a
Meas. Tech.ChEMBL_694005 (CHEMBL1636581)
Ki 45.6±n/a nM
Citation Silvestri, RLigresti, ALa Regina, GPiscitelli, FGatti, VLavecchia, ABrizzi, APasquini, SAllarà, MFantini, NCarai, MABigogno, CRozio, MGSinisi, RNovellino, EColombo, GDi Marzo, VDondio, GCorelli, F Synthesis and biological evaluation of new N-alkyl 1-aryl-5-(1H-pyrrol-1-yl)-1H-pyrazole-3-carboxamides as cannabinoid receptor ligands. Eur J Med Chem45:5878-86 (2010) 
 
Cannabinoid receptor 1
Name:Cannabinoid receptor 1
Type:G Protein-Coupled Receptor (GPCR)
Mol. Mass.:52868.96
Organism:Homo sapiens (Human)
Description:P21554
Residue:472
BDBM50332888
NameBDBM50332888
Synonyms:1-(2,4-Dichlorophenyl)-N-(3,3-dimethylbutyl)-4-methyl-5-(1H-pyrrol-1-yl)-1H-pyrazole-3-carboxamide | CHEMBL1631289
TypeSmall organic molecule
Emp. Form.C21H24Cl2N4O
Mol. Mass.419.347
SMILESCc1c(nn(c1-n1cccc1)-c1ccc(Cl)cc1Cl)C(=O)NCCC(C)(C)C