Reaction Details
TargetNociceptin receptor
LigandBDBM50333099
Substrate/Competitorn/a
Meas. Tech.ChEMBL_690185 (CHEMBL1634315)
IC50 39±n/a nM
Citation Harrison, RSRuiz-Gómez, GHill, TAChow, SYShepherd, NELohman, RJAbbenante, GHoang, HN Novel Helix-Constrained Nociceptin Derivatives Are Potent Agonists and Antagonists of ERK Phosphorylation and Thermal Analgesia in Mice J Med Chem53:8400-8408 (2010) 
 
Nociceptin receptor
Name:Nociceptin receptor
Type:Enzyme Catalytic Domain
Mol. Mass.:40499.09
Organism:MOUSE
Description:Nociceptin/Orphanin FQ, NOP receptor 0 MOUSE::P35377
Residue:367
BDBM50333099
NameBDBM50333099
Synonyms:BzLGlyGGFTGARKSARKLKNQ-NH2 | CHEMBL1631927
TypeSmall organic molecule
Emp. Form.C82H135N29O22
Mol. Mass.1879.1304
SMILES[#6]-[#6](-[#6])-[#6]-[#6@H](-[#7]-[#6](=O)-[#6@H](-[#6]-[#6]-[#6]-[#6]-[#7])-[#7]-[#6](=O)-[#6@H](-[#6]-[#6]-[#6]\[#7]=[#6](/[#7])-[#7])-[#7]-[#6](=O)-[#6@H](-[#6])-[#7]-[#6](=O)-[#6@H](-[#6]-[#8])-[#7]-[#6](=O)-[#6@H](-[#6]-[#6]-[#6]-[#6]-[#7])-[#7]-[#6](=O)-[#6@H](-[#6]-[#6]-[#6]\[#7]=[#6](/[#7])-[#7])-[#7]-[#6](=O)-[#6@H](-[#6])-[#7]-[#6](=O)-[#6]-[#7]-[#6](=O)-[#6@@H](-[#7]-[#6](=O)-[#6@H](-[#6]-c1ccccc1)-[#7]-[#6](=O)-[#6]-[#7]-[#6](=O)-[#6]-[#7]-[#6](=O)-[#6]-[#7]-[#6](=O)-c1ccccc1)-[#6@@H](-[#6])-[#8])-[#6](=O)-[#7]-[#6@@H](-[#6]-[#6]-[#6]-[#6]-[#7])-[#6](=O)-[#7]-[#6@@H](-[#6]-[#6](-[#7])=O)-[#6](=O)-[#7]-[#6@@H](-[#6]-[#6]-[#6](-[#7])=O)-[#6](-[#7])=O