Reaction Details
TargetAcetylcholinesterase
LigandBDBM50333158
Substrate/Competitorn/a
Meas. Tech.ChEMBL_701318 (CHEMBL1648938)
IC50 5000±n/a nM
Citation Samadi, AValderas, Cde los Ríos, CBastida, AChioua, MGonzález-Lafuente, LColmena, IGandía, LRomero, ADel Barrio, LMartín-de-Saavedra, MDLópez, MGVillarroya, MMarco-Contelles, J Cholinergic and neuroprotective drugs for the treatment of Alzheimer and neuronal vascular diseases. II. Synthesis, biological assessment, and molecular modelling of new tacrine analogues from highly substituted 2-aminopyridine-3-carbonitriles. Bioorg Med Chem19:122-33 (2011) 
 
Acetylcholinesterase
Name:Acetylcholinesterase
Type:Enzyme
Mol. Mass.:67659.62
Organism:Bos taurus (bovine)
Description:n/a
Residue:613
BDBM50333158
NameBDBM50333158
Synonyms:5-Amino-7-benzyl-2-methoxy-6,7,8,9-tetrahydropyrido[2,3-b][1,6]naphthyridine-3-carbonitrile | CHEMBL1644731
TypeSmall organic molecule
Emp. Form.C20H19N5O
Mol. Mass.345.3978
SMILESCOc1nc2nc3CCN(Cc4ccccc4)Cc3c(N)c2cc1C#N