Reaction Details
TargetCannabinoid receptor 2
LigandBDBM50334015
Substrate/Competitorn/a
Meas. Tech.ChEMBL_701235 (CHEMBL1648855)
EC50 9±n/a nM
Citation Yang, SWSmotryski, JMatasi, JHo, GTulshian, DGreenlee, WJBrusa, RBeltramo, MCox, K Structure-activity relationships of 2,4-diphenyl-1H-imidazole analogs as CB2 receptor agonists for the treatment of chronic pain. Bioorg Med Chem Lett21:182-5 (2010) 
 
Cannabinoid receptor 2
Name:Cannabinoid receptor 2
Type:G Protein-Coupled Receptor (GPCR)
Mol. Mass.:39690.94
Organism:Homo sapiens (Human)
Description:P34972
Residue:360
BDBM50334015
NameBDBM50334015
Synonyms:1-(2-(3-(morpholinomethyl)phenyl)-4-(3-(trifluoromethyl)phenyl)-1H-imidazol-1-yl)ethanone | CHEMBL1644672
TypeSmall organic molecule
Emp. Form.C23H22F3N3O2
Mol. Mass.429.4349
SMILESCC(=O)n1cc(nc1-c1cccc(CN2CCOCC2)c1)-c1cccc(c1)C(F)(F)F