Reaction Details
TargetCannabinoid receptor 2
LigandBDBM50334016
Substrate/Competitorn/a
Meas. Tech.ChEMBL_701235 (CHEMBL1648855)
EC50 6±n/a nM
Citation Yang, SWSmotryski, JMatasi, JHo, GTulshian, DGreenlee, WJBrusa, RBeltramo, MCox, K Structure-activity relationships of 2,4-diphenyl-1H-imidazole analogs as CB2 receptor agonists for the treatment of chronic pain. Bioorg Med Chem Lett21:182-5 (2010) 
 
Cannabinoid receptor 2
Name:Cannabinoid receptor 2
Type:G Protein-Coupled Receptor (GPCR)
Mol. Mass.:39690.94
Organism:Homo sapiens (Human)
Description:P34972
Residue:360
BDBM50334016
NameBDBM50334016
Synonyms:4-(3-(4-(3-(trifluoromethyl)phenyl)-1H-imidazol-2-yl)benzyl)thiomorpholine | CHEMBL1644676
TypeSmall organic molecule
Emp. Form.C21H20F3N3S
Mol. Mass.403.464
SMILESFC(F)(F)c1cccc(c1)-c1c[nH]c(n1)-c1cccc(CN2CCSCC2)c1