Reaction Details
TargetCannabinoid receptor 2
LigandBDBM50334028
Substrate/Competitorn/a
Meas. Tech.ChEMBL_701235 (CHEMBL1648855)
EC50 5±n/a nM
Citation Yang, SWSmotryski, JMatasi, JHo, GTulshian, DGreenlee, WJBrusa, RBeltramo, MCox, K Structure-activity relationships of 2,4-diphenyl-1H-imidazole analogs as CB2 receptor agonists for the treatment of chronic pain. Bioorg Med Chem Lett21:182-5 (2010) 
 
Cannabinoid receptor 2
Name:Cannabinoid receptor 2
Type:G Protein-Coupled Receptor (GPCR)
Mol. Mass.:39690.94
Organism:Homo sapiens (Human)
Description:P34972
Residue:360
BDBM50334028
NameBDBM50334028
Synonyms:1-(3-(4-(2,3-dichlorophenyl)-1H-imidazol-2-yl)benzyl)-4-fluoropiperidine | CHEMBL1644691
TypeSmall organic molecule
Emp. Form.C21H20Cl2FN3
Mol. Mass.404.308
SMILESFC1CCN(Cc2cccc(c2)-c2nc(c[nH]2)-c2cccc(Cl)c2Cl)CC1