Reaction Details
TargetCannabinoid receptor 2
LigandBDBM50334034
Substrate/Competitorn/a
Meas. Tech.ChEMBL_701235 (CHEMBL1648855)
EC50 130±n/a nM
Citation Yang, SWSmotryski, JMatasi, JHo, GTulshian, DGreenlee, WJBrusa, RBeltramo, MCox, K Structure-activity relationships of 2,4-diphenyl-1H-imidazole analogs as CB2 receptor agonists for the treatment of chronic pain. Bioorg Med Chem Lett21:182-5 (2010) 
 
Cannabinoid receptor 2
Name:Cannabinoid receptor 2
Type:G Protein-Coupled Receptor (GPCR)
Mol. Mass.:39690.94
Organism:Homo sapiens (Human)
Description:P34972
Residue:360
BDBM50334034
NameBDBM50334034
Synonyms:4-fluoro-1-(2-(4-(3-(trifluoromethyl)phenyl)-1H-imidazol-2-yl)benzyl)piperidine | CHEMBL1644737
TypeSmall organic molecule
Emp. Form.C22H21F4N3
Mol. Mass.403.4159
SMILESFC1CCN(Cc2ccccc2-c2nc(c[nH]2)-c2cccc(c2)C(F)(F)F)CC1