Reaction Details
TargetCannabinoid receptor 1
LigandBDBM50334043
Substrate/Competitorn/a
Meas. Tech.ChEMBL_701233 (CHEMBL1648853)
EC50 1055±n/a nM
Citation Yang, SWSmotryski, JMatasi, JHo, GTulshian, DGreenlee, WJBrusa, RBeltramo, MCox, K Structure-activity relationships of 2,4-diphenyl-1H-imidazole analogs as CB2 receptor agonists for the treatment of chronic pain. Bioorg Med Chem Lett21:182-5 (2010) 
 
Cannabinoid receptor 1
Name:Cannabinoid receptor 1
Type:G Protein-Coupled Receptor (GPCR)
Mol. Mass.:52868.96
Organism:Homo sapiens (Human)
Description:P21554
Residue:472
BDBM50334043
NameBDBM50334043
Synonyms:1-(3-(4-(3-chlorophenyl)-1H-imidazol-2-yl)benzyl)piperidine | CHEMBL1644739
TypeSmall organic molecule
Emp. Form.C21H22ClN3
Mol. Mass.351.872
SMILESClc1cccc(c1)-c1c[nH]c(n1)-c1cccc(CN2CCCCC2)c1