Reaction Details
Target5-hydroxytryptamine receptor 6
LigandBDBM50334252
Substrate/Competitorn/a
Meas. Tech.ChEMBL_699426 (CHEMBL1647453)
Ki 15.9±n/a nM
Citation Nirogi, RVDeshpande, ADKambhampati, RBadange, RKKota, LDaulatabad, AVShinde, AKAhmad, IKandikere, VJayarajan, PDubey, PK Indole-3-piperazinyl derivatives: novel chemical class of 5-HT(6) receptor antagonists. Bioorg Med Chem Lett21:346-9 (2010) 
 
5-hydroxytryptamine receptor 6
Name:5-hydroxytryptamine receptor 6
Type:G Protein-Coupled Receptor (GPCR)
Mol. Mass.:46968.43
Organism:Homo sapiens (Human)
Description:P50406
Residue:440
BDBM50334252
NameBDBM50334252
Synonyms:3-(4-methylpiperazin-1-yl)-1-(phenylsulfonyl)-1H-indole | CHEMBL1642416
TypeSmall organic molecule
Emp. Form.C19H21N3O2S
Mol. Mass.355.454
SMILESCN1CCN(CC1)c1cn(c2ccccc12)S(=O)(=O)c1ccccc1