Reaction Details
TargetMitogen-activated protein kinase kinase kinase 5
LigandBDBM50334268
Substrate/Competitorn/a
Meas. Tech.ChEMBL_699648 (CHEMBL1648128)
IC50 14±n/a nM
Citation Okamoto, MSaito, NKojima, HOkabe, TTakeda, KIchijo, HFuruya, TNagano, T Identification of novel ASK1 inhibitors using virtual screening. Bioorg Med Chem19:486-9 (2011) 
 
Mitogen-activated protein kinase kinase kinase 5
Name:Mitogen-activated protein kinase kinase kinase 5
Type:Protein
Mol. Mass.:154514.93
Organism:Homo sapiens (Human)
Description:Q99683
Residue:1374
BDBM50334268
NameBDBM50334268
Synonyms:CHEMBL1642655 N-(6-(1H-imidazol-1-yl)imidazo[1,2-a]pyridin-2-yl)-4-tert-butylbenzamide
TypeSmall organic molecule
Emp. Form.C21H21N5O
Mol. Mass.359.4243
SMILESCC(C)(C)c1ccc(cc1)C(=O)Nc1cn2cc(ccc2n1)-n1ccnc1