Reaction Details
TargetGastric inhibitory polypeptide receptor
LigandBDBM50334486
Substrate/Competitorn/a
Meas. Tech.ChEMBL_701138 (CHEMBL1648236)
IC50 45±n/a nM
Citation Shen, DMBrady, EJCandelore, MRDallas-Yang, QDing, VDFeeney, WPJiang, GMcCann, MEMock, SQureshi, SASaperstein, RShen, XTong, XTota, LMWright, MJYang, XZheng, SChapman, KTZhang, BBTata, JRParmee, ER Discovery of novel, potent, selective, and orally active human glucagon receptor antagonists containing a pyrazole core. Bioorg Med Chem Lett21:76-81 (2010) 
 
Gastric inhibitory polypeptide receptor
Name:Gastric inhibitory polypeptide receptor
Type:PROTEIN
Mol. Mass.:53173.82
Organism:Homo sapiens (Human)
Description:ChEMBL_1518286
Residue:466
BDBM50334486
NameBDBM50334486
Synonyms:CHEMBL1643951 | trans-4-((1-(4-tert-butylcyclohexyl)-3-(4-(trifluoromethoxy)phenyl)ureido)methyl)-N-(2H-tetrazol-5-yl)benzamide
TypeSmall organic molecule
Emp. Form.C27H32F3N7O3
Mol. Mass.559.5833
SMILESCC(C)(C)[C@H]1CC[C@@H](CC1)N(Cc1ccc(cc1)C(=O)Nc1nnn[nH]1)C(=O)Nc1ccc(OC(F)(F)F)cc1