Reaction Details
TargetCholesteryl ester transfer protein
LigandBDBM50334815
Substrate/Competitorn/a
Meas. Tech.ChEMBL_699336 (CHEMBL1647254)
IC50 31±n/a nM
Citation Kallashi, FKim, DKowalchick, JPark, YJHunt, JAAli, ASmith, CJHammond, MLPivnichny, JVTong, XXu, SSAnderson, MSChen, YEveland, SSGuo, QHyland, SAMilot, DPCumiskey, AMLatham, MPeterson, LBRosa, RSparrow, CPWright, SDSinclair, PJ 2-Arylbenzoxazoles as CETP inhibitors: raising HDL-C in cynoCETP transgenic mice. Bioorg Med Chem Lett21:558-61 (2010) 
 
Cholesteryl ester transfer protein
Name:Cholesteryl ester transfer protein
Type:Enzyme
Mol. Mass.:54751.53
Organism:Homo sapiens (Human)
Description:P11597
Residue:493
BDBM50334815
NameBDBM50334815
Synonyms:2-(1-(benzylsulfonyl)piperidin-4-yloxy)-N-(4-(5-cyano-7-methylbenzo[d]oxazol-2-yl)phenyl)acetamide | CHEMBL1642944
TypeSmall organic molecule
Emp. Form.C29H28N4O5S
Mol. Mass.544.621
SMILESCc1cc(cc2nc(oc12)-c1ccc(NC(=O)COC2CCN(CC2)S(=O)(=O)Cc2ccccc2)cc1)C#N