Reaction Details
TargetCholesteryl ester transfer protein
LigandBDBM50334825
Substrate/Competitorn/a
Meas. Tech.ChEMBL_699336 (CHEMBL1647254)
IC50 29±n/a nM
Citation Kallashi, FKim, DKowalchick, JPark, YJHunt, JAAli, ASmith, CJHammond, MLPivnichny, JVTong, XXu, SSAnderson, MSChen, YEveland, SSGuo, QHyland, SAMilot, DPCumiskey, AMLatham, MPeterson, LBRosa, RSparrow, CPWright, SDSinclair, PJ 2-Arylbenzoxazoles as CETP inhibitors: raising HDL-C in cynoCETP transgenic mice. Bioorg Med Chem Lett21:558-61 (2010) 
 
Cholesteryl ester transfer protein
Name:Cholesteryl ester transfer protein
Type:Enzyme
Mol. Mass.:54751.53
Organism:Homo sapiens (Human)
Description:P11597
Residue:493
BDBM50334825
NameBDBM50334825
Synonyms:2-(4-(3-chlorophenyl)piperazin-1-yl)-N-(4-(5-cyano-7-methylbenzo[d]oxazol-2-yl)phenyl)acetamide | CHEMBL1643157
TypeSmall organic molecule
Emp. Form.C27H24ClN5O2
Mol. Mass.485.965
SMILESCc1cc(cc2nc(oc12)-c1ccc(NC(=O)CN2CCN(CC2)c2cccc(Cl)c2)cc1)C#N