Reaction Details
TargetCholesteryl ester transfer protein
LigandBDBM50334828
Substrate/Competitorn/a
Meas. Tech.ChEMBL_699336 (CHEMBL1647254)
IC50 15±n/a nM
Citation Kallashi, FKim, DKowalchick, JPark, YJHunt, JAAli, ASmith, CJHammond, MLPivnichny, JVTong, XXu, SSAnderson, MSChen, YEveland, SSGuo, QHyland, SAMilot, DPCumiskey, AMLatham, MPeterson, LBRosa, RSparrow, CPWright, SDSinclair, PJ 2-Arylbenzoxazoles as CETP inhibitors: raising HDL-C in cynoCETP transgenic mice. Bioorg Med Chem Lett21:558-61 (2010) 
 
Cholesteryl ester transfer protein
Name:Cholesteryl ester transfer protein
Type:Enzyme
Mol. Mass.:54751.53
Organism:Homo sapiens (Human)
Description:P11597
Residue:493
BDBM50334828
NameBDBM50334828
Synonyms:CHEMBL1643160 | N-(4-(5-cyano-7-methylbenzo[d]oxazol-2-yl)phenyl)-2-(4-(3-(trifluoromethyl)phenyl)piperazin-1-yl)acetamide
TypeSmall organic molecule
Emp. Form.C28H24F3N5O2
Mol. Mass.519.5177
SMILESCc1cc(cc2nc(oc12)-c1ccc(NC(=O)CN2CCN(CC2)c2cccc(c2)C(F)(F)F)cc1)C#N