Reaction Details
TargetSphingosine 1-phosphate receptor 1
LigandBDBM22209
Substrate/Competitorn/a
Meas. Tech.ChEMBL_701953 (CHEMBL1657525)
IC50 0.6±n/a nM
Citation Saha, AKYu, XLin, JLobera, MSharadendu, AChereku, SSchutz, NSegal, DMarantz, YMcCauley, DMiddleton, SSiu, JBörli, RWBuys, JHorner, MSalyers, KSchrag, MVargas, HMXu, YMcElvain, M Benzofuran Derivatives as Potent, Orally Active S1P1 Receptor Agonists: A Preclinical Lead Molecule for MS ACS Med Chem Lett2:97-101 (2011) 
 
Sphingosine 1-phosphate receptor 1
Name:Sphingosine 1-phosphate receptor 1
Type:Enzyme
Mol. Mass.:42836.02
Organism:Homo sapiens (Human)
Description:P21453
Residue:382
BDBM22209
NameBDBM22209
Synonyms:1,2,4-oxadiazole based compound, 26 CHEMBL194419
TypeSmall organic molecule
Emp. Form.C23H25N3O3
Mol. Mass.391.4629
SMILESCC(C)Cc1ccc(cc1)-c1nc(no1)-c1ccc(CN2CC(C2)C(O)=O)cc1