Reaction Details
TargetSphingosine 1-phosphate receptor 1
LigandBDBM50335450
Substrate/Competitorn/a
Meas. Tech.ChEMBL_701955 (CHEMBL1657527)
EC50 380±n/a nM
Citation Saha, AKYu, XLin, JLobera, MSharadendu, AChereku, SSchutz, NSegal, DMarantz, YMcCauley, DMiddleton, SSiu, JBörli, RWBuys, JHorner, MSalyers, KSchrag, MVargas, HMXu, YMcElvain, M Benzofuran Derivatives as Potent, Orally Active S1P1 Receptor Agonists: A Preclinical Lead Molecule for MS ACS Med Chem Lett2:97-101 (2011) 
 
Sphingosine 1-phosphate receptor 1
Name:Sphingosine 1-phosphate receptor 1
Type:Enzyme
Mol. Mass.:42836.02
Organism:Homo sapiens (Human)
Description:P21453
Residue:382
BDBM50335450
NameBDBM50335450
Synonyms:1-(4-(5-isobutylbenzofuran-2-yl)benzyl)azetidine-3-carboxylic acid | CHEMBL1651704
TypeSmall organic molecule
Emp. Form.C23H25NO3
Mol. Mass.363.4495
SMILESCC(C)Cc1ccc2oc(cc2c1)-c1ccc(CN2CC(C2)C(O)=O)cc1