Reaction Details
TargetSphingosine 1-phosphate receptor 3
LigandBDBM50335462
Substrate/Competitorn/a
Meas. Tech.ChEMBL_701956 (CHEMBL1657528)
EC50 27000±n/a nM
Citation Saha, AKYu, XLin, JLobera, MSharadendu, AChereku, SSchutz, NSegal, DMarantz, YMcCauley, DMiddleton, SSiu, JBörli, RWBuys, JHorner, MSalyers, KSchrag, MVargas, HMXu, YMcElvain, M Benzofuran Derivatives as Potent, Orally Active S1P1 Receptor Agonists: A Preclinical Lead Molecule for MS ACS Med Chem Lett2:97-101 (2011) 
 
Sphingosine 1-phosphate receptor 3
Name:Sphingosine 1-phosphate receptor 3
Type:G Protein-Coupled Receptor (GPCR)
Mol. Mass.:42278.13
Organism:Homo sapiens (Human)
Description:Q99500
Residue:378
BDBM50335462
NameBDBM50335462
Synonyms:1-(4-(5-benzylbenzofuran-2-yl)-3-fluorobenzyl)azetidine-3-carboxylic acid | CHEMBL1651717
TypeSmall organic molecule
Emp. Form.C26H22FNO3
Mol. Mass.415.4562
SMILESOC(=O)C1CN(Cc2ccc(-c3cc4cc(Cc5ccccc5)ccc4o3)c(F)c2)C1