Reaction Details
TargetSphingosine 1-phosphate receptor 1
LigandBDBM50335448
Substrate/Competitorn/a
Meas. Tech.ChEMBL_701957 (CHEMBL1657529)
EC50 2070±n/a nM
Citation Saha, AKYu, XLin, JLobera, MSharadendu, AChereku, SSchutz, NSegal, DMarantz, YMcCauley, DMiddleton, SSiu, JBörli, RWBuys, JHorner, MSalyers, KSchrag, MVargas, HMXu, YMcElvain, M Benzofuran Derivatives as Potent, Orally Active S1P1 Receptor Agonists: A Preclinical Lead Molecule for MS ACS Med Chem Lett2:97-101 (2011) 
 
Sphingosine 1-phosphate receptor 1
Name:Sphingosine 1-phosphate receptor 1
Type:Enzyme
Mol. Mass.:42836.02
Organism:Homo sapiens (Human)
Description:P21453
Residue:382
BDBM50335448
NameBDBM50335448
Synonyms:1-(4-(5-benzylbenzofuran-2-yl)benzyl)azetidine-3-carboxylic acid | CHEMBL1651702
TypeSmall organic molecule
Emp. Form.C26H23NO3
Mol. Mass.397.4657
SMILESOC(=O)C1CN(Cc2ccc(cc2)-c2cc3cc(Cc4ccccc4)ccc3o2)C1