Reaction Details
TargetSphingosine 1-phosphate receptor 1
LigandBDBM50335465
Substrate/Competitorn/a
Meas. Tech.ChEMBL_701957 (CHEMBL1657529)
EC50 290±n/a nM
Citation Saha, AKYu, XLin, JLobera, MSharadendu, AChereku, SSchutz, NSegal, DMarantz, YMcCauley, DMiddleton, SSiu, JBörli, RWBuys, JHorner, MSalyers, KSchrag, MVargas, HMXu, YMcElvain, M Benzofuran Derivatives as Potent, Orally Active S1P1 Receptor Agonists: A Preclinical Lead Molecule for MS ACS Med Chem Lett2:97-101 (2011) 
 
Sphingosine 1-phosphate receptor 1
Name:Sphingosine 1-phosphate receptor 1
Type:Enzyme
Mol. Mass.:42836.02
Organism:Homo sapiens (Human)
Description:P21453
Residue:382
BDBM50335465
NameBDBM50335465
Synonyms:1-(4-(5-(cyclopropylmethoxy)benzofuran-2-yl)-3-fluorobenzyl)azetidine-3-carboxylic acid | CHEMBL1651720
TypeSmall organic molecule
Emp. Form.C23H22FNO4
Mol. Mass.395.4235
SMILESOC(=O)C1CN(Cc2ccc(-c3cc4cc(OCC5CC5)ccc4o3)c(F)c2)C1