Reaction Details
TargetAurora kinase A
LigandBDBM50224757
Substrate/Competitorn/a
Meas. Tech.ChEMBL_715420 (CHEMBL1664805)
IC50 20000±n/a nM
Citation Lan, PChen, WNChen, WM Molecular modeling studies on imidazo[4,5-b]pyridine derivatives as Aurora A kinase inhibitors using 3D-QSAR and docking approaches. Eur J Med Chem46:77-94 (2010) 
 
Aurora kinase A
Name:Aurora kinase A
Type:Serine/threonine-protein kinase
Mol. Mass.:45830.98
Organism:Homo sapiens (Human)
Description:O14965
Residue:403
BDBM50224757
NameBDBM50224757
Synonyms:4-(6-(4-methoxyphenyl)-3H-imidazo[4,5-b]pyridin-2-yl)-N,N-dimethylbenzenamine | CHEMBL395839
TypeSmall organic molecule
Emp. Form.C21H20N4O
Mol. Mass.344.4097
SMILESCOc1ccc(cc1)-c1cnc2nc([nH]c2c1)-c1ccc(cc1)N(C)C