Reaction Details
TargetLethal factor
LigandBDBM50099857
Substrate/Competitorn/a
Meas. Tech.ChEMBL_715237 (CHEMBL1664438)
IC50 11400000±n/a nM
Citation Jacobsen, JAFullagar, JLMiller, MTCohen, SM Identifying chelators for metalloprotein inhibitors using a fragment-based approach. J Med Chem54:591-602 (2011) 
 
Lethal factor
Name:Lethal factor
Type:PROTEIN
Mol. Mass.:93758.56
Organism:Bacillus anthracis
Description:ChEMBL_1460338
Residue:809
BDBM50099857
NameBDBM50099857
Synonyms:ACETOHYDROXAMIC ACID (AHA) Acethydroxamsaeure Acetic acid, oxime Cetohyroxamic acid Methylhydroxamic acid N-Acetylhydroxylamine acetohydroxamic acid
TypeSmall organic molecule
Emp. Form.C2H5NO2
Mol. Mass.75.0666
SMILESCC(=O)NO