Reaction Details
TargetProstaglandin E2 receptor EP4 subtype
LigandBDBM50335985
Substrate/Competitorn/a
Meas. Tech.ChEMBL_717062 (CHEMBL1671180)
IC50 17±n/a nM
Citation Burch, JDFarand, JColucci, JSturino, CDucharme, YFriesen, RWLévesque, JFGagné, SWrona, MTherien, AGMathieu, MCDenis, DVigneault, EXu, DClark, PRowland, SHan, Y Naphthalene/quinoline amides and sulfonylureas as potent and selective antagonists of the EP4 receptor. Bioorg Med Chem Lett21:1041-6 (2011) 
 
Prostaglandin E2 receptor EP4 subtype
Name:Prostaglandin E2 receptor EP4 subtype
Type:Enzyme
Mol. Mass.:53134.53
Organism:Homo sapiens (Human)
Description:P35408
Residue:488
BDBM50335985
NameBDBM50335985
Synonyms:CHEMBL1669013 | N-(1-(4-(4,9-diethoxy-1-oxo-1H-benzo[f]isoindol-2(3H)-yl)-3-methylbenzyl)cyclopropylcarbamoyl)-4-methylbenzenesulfonamide
TypeSmall organic molecule
Emp. Form.C35H37N3O6S
Mol. Mass.627.75
SMILESCCOc1c2CN(C(=O)c2c(OCC)c2ccccc12)c1ccc(CC2(CC2)NC(=O)NS(=O)(=O)c2ccc(C)cc2)cc1C