Reaction Details
TargetLactoylglutathione lyase
LigandBDBM50336251
Substrate/Competitorn/a
Meas. Tech.ChEMBL_716548 (CHEMBL1670272)
Ki 4600±n/a nM
Citation Yuan, MLuo, MSong, YXu, QWang, XCao, YBu, XRen, YHu, X Identification of curcumin derivatives as human glyoxalase I inhibitors: A combination of biological evaluation, molecular docking, 3D-QSAR and molecular dynamics simulation studies. Bioorg Med Chem19:1189-96 (2011) 
 
Lactoylglutathione lyase
Name:Lactoylglutathione lyase
Type:Enzyme
Mol. Mass.:20772.95
Organism:Homo sapiens (Human)
Description:Q04760
Residue:184
BDBM50336251
NameBDBM50336251
Synonyms:1,7-bis(4-fluorophenyl)-5-hydroxyhepta-1,4,6-trien-3-one | CHEMBL1669724
TypeSmall organic molecule
Emp. Form.C19H14F2O2
Mol. Mass.312.3101
SMILESFc1ccc(C=CC(=O)CC(=O)C=Cc2ccc(F)cc2)cc1