Reaction Details
TargetLactoylglutathione lyase
LigandBDBM50336267
Substrate/Competitorn/a
Meas. Tech.ChEMBL_716548 (CHEMBL1670272)
Ki 65000±n/a nM
Citation Yuan, MLuo, MSong, YXu, QWang, XCao, YBu, XRen, YHu, X Identification of curcumin derivatives as human glyoxalase I inhibitors: A combination of biological evaluation, molecular docking, 3D-QSAR and molecular dynamics simulation studies. Bioorg Med Chem19:1189-96 (2011) 
 
Lactoylglutathione lyase
Name:Lactoylglutathione lyase
Type:Enzyme
Mol. Mass.:20772.95
Organism:Homo sapiens (Human)
Description:Q04760
Residue:184
BDBM50336267
NameBDBM50336267
Synonyms:CHEMBL1669737 | ethyl 2-(3-nitrobenzylidene)-3-oxobutanoate
TypeSmall organic molecule
Emp. Form.C13H13NO5
Mol. Mass.263.246
SMILESCCOC(=O)C(=Cc1cccc(c1)[N+]([O-])=O)C(C)=O