Reaction Details
TargetReceptor-type tyrosine-protein kinase FLT3
LigandBDBM50336457
Substrate/Competitorn/a
Meas. Tech.ChEMBL_716850 (CHEMBL1670772)
IC50 4.9±n/a nM
Citation Napolitano, CNatoni, ASantocanale, CEvensen, LLorens, JBMurphy, PV Isosteric replacement of the Z-enone with haloethyl ketone and E-enone in a resorcylic acid lactone series and biological evaluation. Bioorg Med Chem Lett21:1167-70 (2011) 
 
Receptor-type tyrosine-protein kinase FLT3
Name:Receptor-type tyrosine-protein kinase FLT3
Type:Enzyme
Mol. Mass.:112888.62
Organism:Homo sapiens (Human)
Description:P36888
Residue:993
BDBM50336457
NameBDBM50336457
Synonyms:(3S,5Z,8S,9R,11E)-8,9,16-trihydroxy-14-methoxy-3-methyl-3,4,9,10-tetrahydro-1H-benzo[c][1]oxacyclotetradecine-1,7(8H)-dione CHEMBL1668411 | CHEMBL1801950
TypeSmall organic molecule
Emp. Form.C19H22O7
Mol. Mass.362.3738
SMILESCOc1cc(O)c2c(CCCC(=O)C(=O)C(=O)CCC[C@H](C)OC2=O)c1