Reaction Details
TargetPlatelet-derived growth factor receptor alpha
LigandBDBM50336460
Substrate/Competitorn/a
Meas. Tech.ChEMBL_716843 (CHEMBL1670765)
IC50 450±n/a nM
Citation Napolitano, CNatoni, ASantocanale, CEvensen, LLorens, JBMurphy, PV Isosteric replacement of the Z-enone with haloethyl ketone and E-enone in a resorcylic acid lactone series and biological evaluation. Bioorg Med Chem Lett21:1167-70 (2011) 
 
Platelet-derived growth factor receptor alpha
Name:Platelet-derived growth factor receptor alpha
Type:Protein
Mol. Mass.:122633.38
Organism:Homo sapiens (Human)
Description:P16234
Residue:1089
BDBM50336460
NameBDBM50336460
Synonyms:(S,9E,15Z)-2-ethyl-4,7-dimethyl-5,11-dimethylene-5,6,7,8,11,12,13,14-octahydrobenzo[14]annulene | CHEMBL1668420
TypeSmall organic molecule
Emp. Form.C19H22O5
Mol. Mass.330.375
SMILESCOc1cc(O)c2c(c1)C=CCCCC(=O)C=CC[C@H](C)OC2=O