Reaction Details
TargetVascular endothelial growth factor receptor 2
LigandBDBM50336458
Substrate/Competitorn/a
Meas. Tech.ChEMBL_716854 (CHEMBL1670833)
IC50 4300±n/a nM
Citation Napolitano, CNatoni, ASantocanale, CEvensen, LLorens, JBMurphy, PV Isosteric replacement of the Z-enone with haloethyl ketone and E-enone in a resorcylic acid lactone series and biological evaluation. Bioorg Med Chem Lett21:1167-70 (2011) 
 
Vascular endothelial growth factor receptor 2
Name:Vascular endothelial growth factor receptor 2
Type:Receptor Tyrosine Kinase
Mol. Mass.:151510.97
Organism:Homo sapiens (Human)
Description:P35968
Residue:1356
BDBM50336458
NameBDBM50336458
Synonyms:(3S,5R)-5-bromo-16-hydroxy-14-methoxy-3-methyl-3,4,5,6,9,10,11,12-octahydro-1H-benzo[c][1]oxacyclotetradecine-1,7(8H)-dione | CHEMBL1668415
TypeSmall organic molecule
Emp. Form.C19H25BrO5
Mol. Mass.413.303
SMILESCOc1cc(O)c2c(CCCCCC(=O)C[C@H](Br)C[C@H](C)OC2=O)c1