Reaction Details
TargetVascular endothelial growth factor receptor 2
LigandBDBM50336460
Substrate/Competitorn/a
Meas. Tech.ChEMBL_716854 (CHEMBL1670833)
IC50 2300±n/a nM
Citation Napolitano, CNatoni, ASantocanale, CEvensen, LLorens, JBMurphy, PV Isosteric replacement of the Z-enone with haloethyl ketone and E-enone in a resorcylic acid lactone series and biological evaluation. Bioorg Med Chem Lett21:1167-70 (2011) 
 
Vascular endothelial growth factor receptor 2
Name:Vascular endothelial growth factor receptor 2
Type:Receptor Tyrosine Kinase
Mol. Mass.:151510.97
Organism:Homo sapiens (Human)
Description:P35968
Residue:1356
BDBM50336460
NameBDBM50336460
Synonyms:(S,9E,15Z)-2-ethyl-4,7-dimethyl-5,11-dimethylene-5,6,7,8,11,12,13,14-octahydrobenzo[14]annulene | CHEMBL1668420
TypeSmall organic molecule
Emp. Form.C19H22O5
Mol. Mass.330.375
SMILESCOc1cc(O)c2c(c1)C=CCCCC(=O)C=CC[C@H](C)OC2=O