Reaction Details
TargetDihydrofolate reductase
LigandBDBM50336507
Substrate/Competitorn/a
Meas. Tech.ChEMBL_725476 (CHEMBL1677337)
Ki 1±n/a nM
Citation Wang, FJain, PGulten, GLiu, ZFeng, YGanesula, KMotiwala, ASIoerger, TRAlland, DVilchèze, CJacobs, WRSacchettini, JC Mycobacterium tuberculosis dihydrofolate reductase is not a target relevant to the antitubercular activity of isoniazid. Antimicrob Agents Chemother54:3776-82 (2010) 
 
Dihydrofolate reductase
Name:Dihydrofolate reductase
Type:PROTEIN
Mol. Mass.:17872.62
Organism:Mycobacterium tuberculosis
Description:ChEMBL_102873
Residue:161
BDBM50336507
NameBDBM50336507
Synonyms:4-pyridinecarbohydrazide(Isoniazid) Dow-isoniazid INH Isoniazid (INH) Isonicotinic acid hydrazide(Isoniazid) Laniazid Rimifon isoniazid isonicotinhydrazide isonicotinyl hydrazide | pyridine-4-carbohydrazide
TypeSmall organic molecule
Emp. Form.C6H7N3O
Mol. Mass.137.1393
SMILESNNC(=O)c1ccncc1