Reaction Details
TargetMetallo-beta-lactamase VIM-2
LigandBDBM50336508
Substrate/Competitorn/a
Meas. Tech.ChEMBL_723554 (CHEMBL1676794)
Ki 120000±n/a nM
Citation Ishii, YEto, MMano, YTateda, KYamaguchi, K In vitro potentiation of carbapenems with ME1071, a novel metallo-beta-lactamase inhibitor, against metallo-beta-lactamase- producing Pseudomonas aeruginosa clinical isolates. Antimicrob Agents Chemother54:3625-9 (2010) 
 
Metallo-beta-lactamase VIM-2
Name:Metallo-beta-lactamase VIM-2
Type:Protein
Mol. Mass.:28318.00
Organism:Pseudomonas aeruginosa (g-Proteobacteria)
Description:n/a
Residue:266
BDBM50336508
NameBDBM50336508
Synonyms:CHEMBL1673299 | sodium 2,3-diethylmaleate
TypeSmall organic molecule
Emp. Form.C8H10O4
Mol. Mass.170.1637
SMILESCC\C(C([O-])=O)=C(/CC)C([O-])=O