Reaction Details
TargetBeta-lactamase
LigandBDBM50336509
Substrate/Competitorn/a
Meas. Tech.ChEMBL_723551 (CHEMBL1676791)
Ki 180±n/a nM
Citation Ishii, YEto, MMano, YTateda, KYamaguchi, K In vitro potentiation of carbapenems with ME1071, a novel metallo-beta-lactamase inhibitor, against metallo-beta-lactamase- producing Pseudomonas aeruginosa clinical isolates. Antimicrob Agents Chemother54:3625-9 (2010) 
 
Beta-lactamase
Name:Beta-lactamase
Type:Enzyme Catalytic Domain
Mol. Mass.:27125.88
Organism:Pseudomonas aeruginosa
Description:gi_27368096
Residue:246
BDBM50336509
NameBDBM50336509
Synonyms:CHEMBL116455 Mercaptoacetic acid | SULFANYLACETIC ACID
TypeSmall organic molecule
Emp. Form.C2H4O2S
Mol. Mass.92.117
SMILESOC(=O)CS