Reaction Details
TargetBeta-lactamase
LigandBDBM50336511
Substrate/Competitorn/a
Meas. Tech.ChEMBL_723551 (CHEMBL1676791)
Ki 180±n/a nM
Citation Ishii, YEto, MMano, YTateda, KYamaguchi, K In vitro potentiation of carbapenems with ME1071, a novel metallo-beta-lactamase inhibitor, against metallo-beta-lactamase- producing Pseudomonas aeruginosa clinical isolates. Antimicrob Agents Chemother54:3625-9 (2010) 
 
Beta-lactamase
Name:Beta-lactamase
Type:Enzyme Catalytic Domain
Mol. Mass.:27125.88
Organism:Pseudomonas aeruginosa
Description:gi_27368096
Residue:246
BDBM50336511
NameBDBM50336511
Synonyms:(4R,5S,6S)-3-(benzo[b]thiophen-2-ylthio)-6-((R)-1-hydroxyethyl)-4-methyl-7-oxo-1-azabicyclo[3.2.0]hept-2-ene-2-carboxylic acid | CHEMBL1206553
TypeSmall organic molecule
Emp. Form.C18H17NO4S2
Mol. Mass.375.462
SMILESC[C@@H](O)[C@@H]1[C@H]2[C@@H](C)C(Sc3cc4ccccc4s3)=C(N2C1=O)C(O)=O