Reaction Details
TargetSphingosine 1-phosphate receptor 3
LigandBDBM50336944
Substrate/Competitorn/a
Meas. Tech.ChEMBL_718611 (CHEMBL1680637)
EC50 4880±n/a nM
Citation Lanman, BACee, VJCheruku, SRFrohn, MGolden, JLin, JLobera, MMarantz, YMuller, KMNeira, SCPickrell, AJRivenzon-Segal, DSchutz, NSharadendu, AYu, XZhang, ZBuys, JFiorino, MGore, AHorner, MItano, AMcElvain, MMiddleton, SSchrag, MVargas, HMXu, HXu, YZhang, XSiu, J Discovery of a Potent, S1P3-Sparing Benzothiazole Agonist of Sphingosine-1-Phosphate Receptor 1 (S1P1ACS Med Chem Lett2:102-106 (2011) 
 
Sphingosine 1-phosphate receptor 3
Name:Sphingosine 1-phosphate receptor 3
Type:G Protein-Coupled Receptor (GPCR)
Mol. Mass.:42278.13
Organism:Homo sapiens (Human)
Description:Q99500
Residue:378
BDBM50336944
NameBDBM50336944
Synonyms:1-((4-(5-(2-Chlorobenzyl)benzo[d]thiazol-2-yl)-3-fluorophenyl)methyl)azetidine-3-carboxylic acid | CHEMBL1672567
TypeSmall organic molecule
Emp. Form.C25H20ClFN2O2S
Mol. Mass.466.955
SMILESOC(=O)C1CN(Cc2ccc(-c3nc4cc(Cc5ccccc5Cl)ccc4s3)c(F)c2)C1