Reaction Details
TargetSphingosine 1-phosphate receptor 1
LigandBDBM50336956
Substrate/Competitorn/a
Meas. Tech.ChEMBL_718609 (CHEMBL1680635)
EC50 94±n/a nM
Citation Lanman, BACee, VJCheruku, SRFrohn, MGolden, JLin, JLobera, MMarantz, YMuller, KMNeira, SCPickrell, AJRivenzon-Segal, DSchutz, NSharadendu, AYu, XZhang, ZBuys, JFiorino, MGore, AHorner, MItano, AMcElvain, MMiddleton, SSchrag, MVargas, HMXu, HXu, YZhang, XSiu, J Discovery of a Potent, S1P3-Sparing Benzothiazole Agonist of Sphingosine-1-Phosphate Receptor 1 (S1P1ACS Med Chem Lett2:102-106 (2011) 
 
Sphingosine 1-phosphate receptor 1
Name:Sphingosine 1-phosphate receptor 1
Type:Enzyme
Mol. Mass.:42836.02
Organism:Homo sapiens (Human)
Description:P21453
Residue:382
BDBM50336956
NameBDBM50336956
Synonyms:1-(4-(6-Benzylbenzo[d]oxazol-2-yl)-3-fluorobenzyl)azetidine-3-carboxylic acid | CHEMBL1672555
TypeSmall organic molecule
Emp. Form.C25H21FN2O3
Mol. Mass.416.4442
SMILESOC(=O)C1CN(Cc2ccc(-c3nc4ccc(Cc5ccccc5)cc4o3)c(F)c2)C1