Reaction Details
TargetSphingosine 1-phosphate receptor 1
LigandBDBM50336951
Substrate/Competitorn/a
Meas. Tech.ChEMBL_718609 (CHEMBL1680635)
EC50 42±n/a nM
Citation Lanman, BACee, VJCheruku, SRFrohn, MGolden, JLin, JLobera, MMarantz, YMuller, KMNeira, SCPickrell, AJRivenzon-Segal, DSchutz, NSharadendu, AYu, XZhang, ZBuys, JFiorino, MGore, AHorner, MItano, AMcElvain, MMiddleton, SSchrag, MVargas, HMXu, HXu, YZhang, XSiu, J Discovery of a Potent, S1P3-Sparing Benzothiazole Agonist of Sphingosine-1-Phosphate Receptor 1 (S1P1ACS Med Chem Lett2:102-106 (2011) 
 
Sphingosine 1-phosphate receptor 1
Name:Sphingosine 1-phosphate receptor 1
Type:Enzyme
Mol. Mass.:42836.02
Organism:Homo sapiens (Human)
Description:P21453
Residue:382
BDBM50336951
NameBDBM50336951
Synonyms:1-((4-(5-(2,4-Difluorobenzyl)benzo[d]thiazol-2-yl)-3-fluorophenyl)methyl)azetidine-3-carboxylic acid | CHEMBL1672561
TypeSmall organic molecule
Emp. Form.C25H19F3N2O2S
Mol. Mass.468.491
SMILESOC(=O)C1CN(Cc2ccc(-c3nc4cc(Cc5ccc(F)cc5F)ccc4s3)c(F)c2)C1