Reaction Details
TargetAndrogen receptor
LigandBDBM50336997
Substrate/Competitorn/a
Meas. Tech.ChEMBL_718320 (CHEMBL1679740)
EC50 0.1±n/a nM
Citation Miller, CPShomali, MLyttle, CRO’Dea, LSHerendeen, HGallacher, KPaquin, DCompton, DRSahoo, BKerrigan, SABurge, MSNickels, MGreen, JLKatzenellenbogen, JATchesnokov, A Design, Synthesis, and Preclinical Characterization of the Selective Androgen Receptor Modulator (SARM) RAD140 ACS Med Chem Lett2:124-129 (2011) 
 
Androgen receptor
Name:Androgen receptor
Type:Receptor
Mol. Mass.:99185.27
Organism:Homo sapiens (Human)
Description:CHO cells were stably transfected with human AR gene.
Residue:920
BDBM50336997
NameBDBM50336997
Synonyms:2-chloro-4-((1R,2S)-1-(5-(4-cyanophenyl)-1,3,4-oxadiazol-2-yl)-2-hydroxypropylamino)-3-methylbenzonitrile | CHEMBL1672635
TypeSmall organic molecule
Emp. Form.C20H16ClN5O2
Mol. Mass.393.826
SMILESC[C@H](O)[C@@H](Nc1ccc(C#N)c(Cl)c1C)c1nnc(o1)-c1ccc(cc1)C#N