Reaction Details
TargetGamma-aminobutyric acid receptor subunit alpha-1
LigandBDBM50337264
Substrate/Competitorn/a
Meas. Tech.ChEMBL_726365 (CHEMBL1687497)
IC50 50±n/a nM
Citation Hintermann, SHurth, KNozulak, JTintelnot-Blomley, MAichholz, RBlanz, JKaupmann, KMosbacher, J Exploring subtype selectivity and metabolic stability of a novel series of ligands for the benzodiazepine binding site of the GABAA receptor. Bioorg Med Chem Lett21:1523-6 (2011) 
 
Gamma-aminobutyric acid receptor subunit alpha-1
Name:Gamma-aminobutyric acid receptor subunit alpha-1
Type:Protein
Mol. Mass.:51817.35
Organism:Homo sapiens (Human)
Description:P14867
Residue:456
BDBM50337264
NameBDBM50337264
Synonyms:2-(benzo[d][1,3]dioxol-5-yl)-3-(2-chlorobenzyloxy)-2H-pyrazolo[4,3-c]quinoline | CHEMBL1681888
TypeSmall organic molecule
Emp. Form.C24H16ClN3O3
Mol. Mass.429.855
SMILESClc1ccccc1COc1n(nc2c1cnc1ccccc21)-c1ccc2OCOc2c1