Reaction Details
TargetLysosomal Pro-X carboxypeptidase
LigandBDBM50338007
Substrate/Competitorn/a
Meas. Tech.ChEMBL_727163 (CHEMBL1687134)
IC50 0.8±n/a nM
Citation Shen, HCDing, FXZhou, CXiong, YVerras, AChabin, RMXu, STong, XXie, DLassman, MEBhatt, URGarcia-Calvo, MMGeissler, WShen, ZChen, DSinharoy, RHale, JJTata, JRPinto, SShen, DMColletti, SL Discovery of benzimidazole pyrrolidinyl amides as prolylcarboxypeptidase inhibitors. Bioorg Med Chem Lett21:1299-305 (2011) 
 
Lysosomal Pro-X carboxypeptidase
Name:Lysosomal Pro-X carboxypeptidase
Type:PROTEIN
Mol. Mass.:55028.96
Organism:Mus musculus
Description:ChEMBL_1335505
Residue:491
BDBM50338007
NameBDBM50338007
Synonyms:(S)-1-(2-(5,6-dichloro-1H-benzo[d]imidazol-2-yl)pyrrolidin-1-yl)-3-(4-(1-methyl-5-(pyridin-4-yl)-1H-pyrazol-3-yl)piperidin-1-yl)propan-1-one | CHEMBL1684306
TypeSmall organic molecule
Emp. Form.C28H31Cl2N7O
Mol. Mass.552.498
SMILESCn1nc(cc1-c1ccncc1)C1CCN(CCC(=O)N2CCC[C@H]2c2nc3cc(Cl)c(Cl)cc3[nH]2)CC1