Reaction Details
TargetEnoyl-[acyl-carrier-protein] reductase [NADPH] FabI [9-251]
LigandBDBM50338300
Substrate/Competitorn/a
Meas. Tech.ChEMBL_728028 (CHEMBL1686899)
IC50 6000±n/a nM
Citation Cho, JYKwon, YJSohn, MJSeok, SJKim, WG Phellinstatin, a new inhibitor of enoyl-ACP reductase produced by the medicinal fungus Phellinus linteus. Bioorg Med Chem Lett21:1716-8 (2011) 
 
Enoyl-[acyl-carrier-protein] reductase [NADPH] FabI [9-251]
Name:Enoyl-[acyl-carrier-protein] reductase [NADPH] FabI [9-251]
Type:PROTEIN
Mol. Mass.:26446.66
Organism:Staphylococcus aureus
Description:ChEMBL_1455655
Residue:243
BDBM50338300
NameBDBM50338300
Synonyms:CHEMBL1682259 | phellinstatin
TypeSmall organic molecule
Emp. Form.C39H26O15
Mol. Mass.734.6147
SMILESOc1cc(oc(=O)c1)[C@@H]1[C@H](Oc2cc(\C=C\c3cc(O)c(O)cc3-c3c(O)cc(\C=C\c4ccc(O)c(O)c4)oc3=O)oc(=O)c12)c1ccc(O)c(O)c1