Reaction Details
TargetB-cell receptor CD22
LigandBDBM50338743
Substrate/Competitorn/a
Meas. Tech.ChEMBL_727025 (CHEMBL1686885)
IC50 100±n/a nM
Citation Abdu-Allah, HHWatanabe, KCompleto, GCSadagopan, MHayashizaki, KTakaku, CTamanaka, TTakematsu, HKozutsumi, YPaulson, JCTsubata, TAndo, HIshida, HKiso, M CD22-antagonists with nanomolar potency: the synergistic effect of hydrophobic groups at C-2 and C-9 of sialic acid scaffold. Bioorg Med Chem19:1966-71 (2011) 
 
B-cell receptor CD22
Name:B-cell receptor CD22
Type:PROTEIN
Mol. Mass.:96597.27
Organism:Mus musculus
Description:ChEMBL_727025
Residue:862
BDBM50338743
NameBDBM50338743
Synonyms:CHEMBL1684360 | benzyl 3,5,9-trideoxy-5-glycolamido-9-(4'-hydroxy-4-biphenyl)acetamido-D-glycero-alpha-D-galacto-2-nonulopyranosidonic acid
TypeSmall organic molecule
Emp. Form.C32H36N2O11
Mol. Mass.624.635
SMILESOCC(=O)N[C@@H]1[C@@H](O)C[C@@](OCc2ccccc2)(O[C@H]1[C@H](O)[C@H](O)CNC(=O)Cc1ccc(cc1)-c1ccc(O)cc1)C(O)=O