Reaction Details
TargetB-cell receptor CD22
LigandBDBM50338746
Substrate/Competitorn/a
Meas. Tech.ChEMBL_727026 (CHEMBL1686886)
IC50 820±n/a nM
Citation Abdu-Allah, HHWatanabe, KCompleto, GCSadagopan, MHayashizaki, KTakaku, CTamanaka, TTakematsu, HKozutsumi, YPaulson, JCTsubata, TAndo, HIshida, HKiso, M CD22-antagonists with nanomolar potency: the synergistic effect of hydrophobic groups at C-2 and C-9 of sialic acid scaffold. Bioorg Med Chem19:1966-71 (2011) 
 
B-cell receptor CD22
Name:B-cell receptor CD22
Type:PROTEIN
Mol. Mass.:95348.60
Organism:Homo sapiens (Human)
Description:ChEMBL_727026
Residue:847
BDBM50338746
NameBDBM50338746
Synonyms:Benzyl 3,5,9-trideoxy-5-glycolamido-9-(4'-hydroxy-4-biphenyl)methylamino-D-glycero-alpha-D-galacto-2-nonulopyranosidonic acid | CHEMBL1684363
TypeSmall organic molecule
Emp. Form.C31H36N2O10
Mol. Mass.596.6249
SMILESOCC(=O)N[C@@H]1[C@@H](O)C[C@@](OCc2ccccc2)(O[C@H]1[C@H](O)[C@H](O)CNCc1ccc(cc1)-c1ccc(O)cc1)C(O)=O